[Box Backup] Trunk_1871

Matt Brown boxbackup@fluffy.co.uk
Wed, 17 Oct 2007 10:32:35 +0100

Hi Chris,

I have this morning checked out 1871 and tried to compile and test,  
however the tests failed.

FAILED: 2 tests failed (first at ../../lib/server/ServerControl.h:136)
common: PASSED
crypto: PASSED
compress: PASSED
raidfile: PASSED
basicserver: PASSED
backupstore: PASSED
backupstorefix: PASSED
backupstorepatch: PASSED
backupdiff: PASSED
bbackupd: FAILED: 2 tests failed (first at ../../lib/server/ 
make: *** [release/common/test] Error 1

Just thought you might like to know... btw any joy with the Mac ?


Matt Brown